Weaviate container crash loop in Kubernetes deployment

photo of computer cables

Problem – Weaviate Container CrashLoopBackOff in Kubernetes A production deployment of Weaviate on a multi‑node Kubernetes cluster repeatedly enters CrashLoopBackOff. The pod terminates shortly after start, causing the service to be unavailable for queries. Typical symptoms observed in the cluster: Pod status: CrashLoopBackOff after a few seconds. Readiness probe errors such as: Readiness probe failed: … Read more

ONNX Runtime RAG reranker timeout during inference serving

a close up of a web page on a computer

Problem – RAG Reranker Timeout During Inference Serving The Retrieval‑Augmented Generation (RAG) pipeline is deployed on a production inference service that uses ONNX Runtime for low‑latency model execution. Under moderate request load the reranker stage fails to finish within the allocated time budget, causing the entire request to time‑out. Typical symptoms observed in logs: Ort::Exception: … Read more

Prometheus RAG retrieval empty results in CI/CD pipeline

angel statue on brown wooden floor

Problem Description During automated integration tests executed in a CI/CD pipeline, a Prometheus instance that is configured for Retrieval‑Augmented Generation (RAG) consistently returns empty result vectors. The same pipeline runs successfully on a developer’s workstation, but in the pipeline the query endpoint responds with messages such as: retrieval returned empty vector no data found for … Read more

RAG document loader crash during backup restoration

Giant optimus prime statue illuminated at night

Problem Description During a disaster‑recovery run, the RAG DocumentLoader used by a Hugging Face Transformers RagSequenceForGeneration pipeline crashes while ingesting documents from a cloud‑based backup. The restoration process aborts, leaving the knowledge base unavailable. Typical error output observed in the logs: Traceback (most recent call last): File “/opt/app/rag_loader.py”, line 112, in load_documents documents = loader.load() … Read more

Qwen local development blocked by network policy

yellow and white square box

Problem – Qwen Local Development Blocked by Network Policy During local development of Qwen‑based applications, the SDK fails to download model weights or reach the Qwen API. Typical symptoms observed on a developer workstation behind a corporate firewall include: ConnectionError: Failed to establish a new connection: [Errno 111] Connection refused HTTPError 403: Forbidden – https://huggingface.co/…/resolve/main/pytorch_model.bin … Read more

Mistral AI index rebuild failure during model inference

A person holding a smart phone in their hand

Problem – Index Rebuild Failure During Model Inference In a production deployment of Mistral AI serving a large language model, the inference endpoint becomes unresponsive or shows severe latency spikes after the system attempts to rebuild its vector index. Typical symptoms include: Endpoint returns HTTP 502/504 after a few minutes of uptime. Logs contain messages such … Read more

LangChain PVC stuck in pending state after deployment

cable network

Problem – LangChain PVC Stuck in Pending After Deployment When deploying LangChain components (e.g., the vector‑store or document‑loader pods) on a managed Kubernetes cluster with dynamic storage provisioning enabled, the associated PersistentVolumeClaim (PVC) often remains in the Pending state. The pod cannot start, leading to crash loops and a non‑functional AI workflow. Typical symptoms observed in … Read more

LlamaIndex inference queue backlog during A/B testing

photo of computer cables

Problem – Inference Queue Backlog During A/B Testing During a recent high‑traffic A/B test two LlamaIndex variants (A and B) were deployed side‑by‑side in a Kubernetes cluster. Users of the test variant experienced: Latency spikes from ~200 ms to >30 s. HTTP 503 responses with the log line Inference queue full: max_queue_size reached. Increasing numbers of “Worker … Read more

Prometheus tokenizer encoding error with non-standard characters

a golden statue of a man and a woman on a boat

Problem: Prometheus tokenizer encoding error with non‑standard characters During the rollout of an A/B testing experiment, the Prometheus server began reporting scrape failures. The logs contained messages such as: error parsing metric: invalid UTF-8 string in label value “variant=🧪” error parsing metric: invalid UTF-8 string in label value “experiment=beta©” failed to ingest metric: label value … Read more

Kubernetes CRD validation errors after schema update

a group of blue boxes

Problem – Validation Errors After Updating a CRD Schema After a recent schema change to a shared Custom Resource Definition (CRD) used by multiple AI/ML services, kubectl apply and CI/CD pipelines began failing with errors such as: error: admission webhook “v1.crdvalidation.k8s.io” denied the request: spec: Required value Other observed messages include: validation failed: spec.replicas: Invalid … Read more